From: Rich Kilmer Date: 2002-07-21T03:12:16+09:00 Subject: RE: [ANN] amrita 0.8.1 You need strscan: See: http://www.loveruby.net/ja/prog/strscan.html -rich > -----Original Message----- > From: Jim Freeze [mailto:jfreeze@freebsdportal.com] > Sent: Saturday, July 20, 2002 11:16 AM > To: ruby-talk ML > Subject: Re: [ANN] amrita 0.8.1 > > Hi: > > I downloaded amrita (stable version) and ran > make test_it > > and got several errors. Did I do something wrong or get the > incorrect version? > > Thanks > > Jim > > make test_it > (cd test; ruby -I../lib testall.rb) > E.E..E.E.E.E.E.E.E.E.E.E.E.E.E.E.E.E.E.E.E.E.E.E.E.E.E.E.E.E.E.E.E.E.E.E .E > .E.E.E..E.E.E.F.......................E.....E......... > Time: 0.654986 > FAILURES!!! > Test Results: > Run: 82/82(158 asserts) Failures: 1 Errors: 45 > Failures: 1 > ./testparser.rb:31:in `test_scanner'(TestHtmlParser): > expected:<[# "xxx.gif"]], @name="img">]> but > was:<[#]> > (RUNIT::AssertionFailedError) > from testall.rb:22 > Errors: 45 > ../lib/amrita/parser.rb:433:in `parse'(TestFormat): error hapend in :4(

> can't be in ) > ==> id="body">body text will be inserted here

> > > > (Amrita::HtmlParseError) > from ../lib/amrita/parser.rb:398:in `parse_text' > from ./testformat.rb:50:in `test_asisformatter' > from testall.rb:22 > ../lib/amrita/parser.rb:433:in `parse'(TestFormat): error hapend in > :0(

can't be in <__id>) > > > -- > Jim Freeze > If only I had something clever to say for my comment... > ~