From: Phlip Date: 2009-04-15T22:05:05+09:00 Subject: Re: small bounties for fixing this text editor (written in ruby) Roger Pack wrote: > They're not much, but since I'm rather lazy, I've offered a few bounties > for anyone wanting to improve the arcadia ruby text editor > http://wiki.github.com/angal/arcadia/to-do > at the bottom. Is this one of the TODOs? $ sudo gem install arcadia Building native extensions. This could take a while... ERROR: Error installing arcadia: ERROR: Failed to build gem native extension. /usr/bin/ruby extconf.rb install arcadia creating Makefile make gcc -I. -I/usr/lib/ruby/1.8/i686-linux -I/usr/lib/ruby/1.8/i686-linux -I. -D_FILE_OFFSET_BITS=64 -fPIC -g -O2 -c trace_nums.c In file included from trace_nums.c:36: /usr/lib/ruby/1.8/i686-linux/node.h:391: error: expected ‘=’, ‘,’, ‘;’, ‘asm’ or ‘__attribute__’ before ‘rb_jmpbuf_t’ /usr/lib/ruby/1.8/i686-linux/node.h:405: error: expected specifier-qualifier-list before ‘rb_jmpbuf_t’ make: *** [trace_nums.o] Error 1