From: john maclean Date: 2009-04-06T21:19:33+09:00 Subject: make error during svn build (192) any pointers on this build error? git svn clone http://svn.ruby-lang.org/repos/ruby/trunk ruby --revision 22000:23142 cd ruby gc clean autoconf --verbose ./configure --prefix=/home/jayeola/ix -program-suffix=192 # snip checking limits.h presence... yes configure: WARNING: limits.h: present but cannot be compiled configure: WARNING: limits.h: check for missing prerequisite headers? configure: WARNING: limits.h: see the Autoconf documentation configure: WARNING: limits.h: section "Present But Cannot Be Compiled" configure: WARNING: limits.h: proceeding with the preprocessor's result configure: WARNING: limits.h: in the future, the compiler will take precedence # snip version.h:42:23: error: revision.h: No such file or directory checking for nroff... /usr/bin/nroff config.h unchanged ruby192 library version = 1.9.1 configure: creating ./config.status config.status: creating Makefile make gcc -g -O2-O3 -g -Wall -Wno-unused-parameter -Wno-parentheses -Wno-missing-field-initializers -Wpointer-arith -Wwrite-strings -I. -I.ext/include/i686-linux -I./include -I. -DRUBY_EXPORT -o main.o -c main.c cc1: error: invalid option argument ‘-O2-O3’ make: *** [main.o] Error 1 -- John Maclean 07739 171 531 MSc (DIC) Timezone: GMT