From: Jim Freeze Date: 2006-02-04T04:36:26+09:00 Subject: Compile problems with 1.8.4 on HP Hi Ruby 1.8.4 doesn't want to build on my HP machine. I get the following error: cc -s -DRUBY_EXPORT -DYYMAXDEPTH=300 -I. -I. -c eval.c (Bundled) cc: "eval.c", line 1657: error 1000: Unexpected symbol: "VALUE". (Bundled) cc: "eval.c", line 1657: error 1705: Function prototypes are an ANSI feature. (Bundled) cc: "eval.c", line 1657: error 1573: Type of "VALUE" is undefined due to an illegal declaration. (Bundled) cc: "eval.c", line 2567: error 1000: Unexpected symbol: "event". (Bundled) cc: "eval.c", line 2569: error 1588: "event" undefined. (Bundled) cc: "eval.c", line 4681: error 1000: Unexpected symbol: "VALUE". (Bundled) cc: "eval.c", line 4681: error 1705: Function prototypes are an ANSI feature. (Bundled) cc: "eval.c", line 4681: error 1573: Type of "VALUE" is undefined due to an illegal declaration. (Bundled) cc: "eval.c", line 9809: warning 546: Conflicting enumeration types used in expression. (Bundled) cc: "eval.c", line 9814: warning 546: Conflicting enumeration types used in expression. gmake: *** [eval.o] Error 1 Any ideas appreciated. -- Jim Freeze