From: mkcon@... (Martin Kahlert) Date: 2004-11-05T16:18:42+09:00 Subject: FXRuby and the latest snapshot(s) Hi! i am not able to compile FXRuby since about 1 month with the latest snapshots. I tried the old (1.0.29 with the latest fox-1.0.53) and the new API (1.2.2 and fox-1.2.11). I use linux and gcc-3.4.2. Here is the error i get: $ ruby install.rb setup install.rb: entering setup phase... ---> lib ---> lib/fox12 <--- lib/fox12 <--- lib ---> ext ---> ext/fox12 make g++ -fPIC -O2 -O0 -Iinclude -I. -I/SW/lib/ruby/1.8/i686-linux -I/SW/lib/ruby/1.8/i686-linux -I/home/martin/FXRuby-1.2.2/ext/fox12 -DHAVE_SYS_TIME_H -DHAVE_SIGNAL_H -I/usr/local/include/fxscintilla -I/SW/include/fox-1.2 -c FXRuby.cpp FXRuby.cpp:64: error: declaration of C function `void st_foreach(st_table*, int (*)(char*, char*, char*), char*)' conflicts with /SW/lib/ruby/1.8/i686-linux/intern.h:249: error: previous declaration `void st_foreach(st_table*, int (*)(), long unsigned int)' here make: *** [FXRuby.o] Error 1 setup failed 'system make ' failed Try 'ruby install.rb --help' for detailed usage. Any ideas how to repair this? Regards Martin.