From: "akira yamada / やまだあきら" Date: 2000-08-31T17:47:34+09:00 Subject: [ruby-dev:10763] Re: ruby 1.6.0 preview Thu, 31 Aug 2000 17:13:08 +0900 頃の Mail-Count: 10762 Subject: [ruby-dev:10762] ruby 1.6.0 preview についてのお話にて Yukihiro Matsumoto さん曰く… (Y == matz@zetabits.com (Yukihiro Matsumoto) さん) In article 10762, Y> 今日リリース予定の1.6.0ですが、駆け込みで修正したバグがいく Y> つかあるので、previewを出すことにしました。 Y> Y> ftp://ftp.netlab.co.jp/pub/lang/ruby/ruby-1.6.0-preview.tar.gz CVS の最新(同じものですよね)を作ってテスト用の deb パッケージを 作ってみているんですが, インストールの最中にコケますね. defines.h -> /home/akira/deb/ruby16/ruby16-1.6.0/debian/tmp/usr/lib/ruby/1.6/i486-linux/defines.h chmod 0644 /home/akira/deb/ruby16/ruby16-1.6.0/debian/tmp/usr/lib/ruby/1.6/i486-linux/defines.h intern.h -> /home/akira/deb/ruby16/ruby16-1.6.0/debian/tmp/usr/lib/ruby/1.6/i486-linux/intern.h /home/akira/deb/ruby16/ruby16-1.6.0/build-tree/ruby/lib/ftools.rb:37: [BUG] rb_gc_mark(): unknown data type 0x20(0x80d41f8) non object ruby 1.6.0 (2000-08-31) [i486-linux] make[1]: *** [install] 中断しました make[1]: 出ます ディレクトリ `/home/akira/deb/ruby16/ruby16-1.6.0/build-tree/ruby' make: *** [debian/stampdir/install] エラー 2 debuild: fatal error at line 293: dpkg-buildpackage failed: 不正なシークです こんな感じです. -- やまだ あきら (akira@arika.org, akira@ruby-lang.org or akira@ad-hoc.org)