From: Hugh Sasse Date: 2006-09-18T22:14:48+09:00 Subject: 1.9 build failure. Testing a patch (nowhere near digest) against the latest 1.9 on Sun Sparc Solaris9 I get gcc -I. -I../.. -I../../. -I../.././ext/digest -DRUBY_EXTCONF_H=\"extconf.h\" -fPIC -g -O2 -c digest_new.c digest_new.c: In function 'rb_digest_base_s_digest': digest_new.c:100: error: 'struct RString' has no member named 'ptr' digest_new.c:100: error: 'struct RString' has no member named 'len' digest_new.c: In function 'rb_digest_base_s_hexdigest': digest_new.c:129: error: 'struct RString' has no member named 'ptr' digest_new.c:129: error: 'struct RString' has no member named 'len' digest_new.c: In function 'rb_digest_base_update': digest_new.c:180: error: 'struct RString' has no member named 'ptr' digest_new.c:180: error: 'struct RString' has no member named 'len' digest_new.c: In function 'rb_digest_base_equal': digest_new.c:303: error: 'struct RString' has no member named 'len' digest_new.c:308: error: 'struct RString' has no member named 'len' digest_new.c:308: error: 'struct RString' has no member named 'len' gmake[1]: *** [digest_new.o] Error 1 gmake[1]: Leaving directory `/home/hgs/rubycvs/ruby_build/ext/digest' gmake: *** [all] Error 1 Anyone else seeing this? Hugh