From: Roger Pack Date: 2009-05-18T23:07:59+09:00 Subject: [ruby-core:23495] [Bug #863] Openssl issues with fresh compile on Ubuntu Issue #863 has been updated by Roger Pack. I would double check it but 1.8.7 from source gives me: make[1]: Entering directory `/free_space/rdp/downloads/ruby_1_8_svn/ext/thread' gcc -I. -I../.. -I../../. -I../.././ext/thread -D_FILE_OFFSET_BITS=64 -DUSE_MEM_POOLS -fPIC -O2 -g -Wall -Wno-parentheses -fPIC -c thread.c thread.c: In function ���unlock_mutex_inner���: thread.c:485: error: ���list��� undeclared (first use in this function) thread.c:485: error: (Each undeclared identifier is reported only once thread.c:485: error: for each function it appears in.) make[1]: *** [thread.o] Error 1 make[1]: Leaving directory `/free_space/rdp/downloads/ruby_1_8_svn/ext/thread' make: *** [mkmain.sh] Error 1 :) -=r ---------------------------------------- http://redmine.ruby-lang.org/issues/show/863 ---------------------------------------- http://redmine.ruby-lang.org